{"text_format":"3","workbook":"xlsx","n_sheets":3,"sheets":["Instrukcja wypełniania DPAE","DPAE","Dane do przeliczeń"],"not_rendered":{"images":1,"defined_names":3},"read":"whole","date_system":"1900"}

{"sheet":"Instrukcja wypełniania DPAE","index":0,"n_rows":20,"n_cols":2,"rows_kept":20,"merged":[[0,0,0,17],[1,1,1,17],[2,1,2,17],[3,1,3,17],[4,1,4,17],[5,1,5,17],[6,1,6,17],[7,1,7,17],[8,1,8,17],[9,1,9,17],[10,1,10,17],[11,1,11,17],[12,1,12,17],[14,1,14,17],[15,1,15,17],[16,1,16,17],[18,1,18,17],[19,0,19,17]]}
["INSTRUKCJA WYPEŁNIANIA DOKUMENTU PODSUMOWUJĄCEGO AUDYT ENERGETYCZNY \nDOKUMENT POMOCNICZY DLA AUDYTORÓW ENERGETYCZNYCH W RAMACH PROGRAMU PRIORYTETOWEGO CIEPŁE MIESZKANIE"]
["1.","W Dokumencie należy wypełniać jedynie pola w kolorze białym, z wyjątkiem sytuacji opisanych poniżej w pkt 5.3 poniżej (pola w kolorze jasnożółtym lub jasnozielonym)."]
["2.","Pola w odcieniach szarości, a także pola w kolorze żółtym i zielonym zawierające jednostki nie powinny być wypełniane."]
["3.","Sekcja I Dane o budynku mieszkalnym / lokalu mieszkalnym"]
["3.1","W sekcji należy podać dane dot. budynku / lokalu mieszkalnego."]
["4.","W sekcji II. Zakres rzeczowy wchodzący w skład wariantu optymalnego z audytu energetycznego (wariantu wybranego do realizacji przez audytora) należy wpisywać przedsięwzięcia/ulepszenia/usprawnienia wskazane do realizacji w wariancie optymalnym. Przedsięwzięcia te powinny być ujęte w sposób skrótowy/hasłowy, a jednocześnie powinny umożliwiać w prosty sposób ich weryfikację z pojęciami wpisanymi do audytu energetycznego, np.: modernizacja systemu grzewczego i systemu przygotowania ciepłej wody użytkowej w odniesieniu do kosztów kwalifikowanych Programu. \nW przypadku ocieplenia przegród budowlanych należy podać wartość współczynnika przenikania ciepła przegrody U przed termomodernizacją i po termomodernizacji. W pozostałych przypadkach należy wpisać \"nie dotyczy\". \nJeżeli w audycie energetycznym znajduje się więcej pozycji z zakresu rzeczowego przedsięwzięcia jak wierszy w niniejszym Dokumencie podsumowującym audyt energetyczny, kolejne pozycje należy dodawać w jednym wierszu, co można zrobić przez użycie skrótu klawiszowego ALT+ENTER w oknie komórki."]
["4.1","Jeżeli audyt energetyczny uwzględnia instalację kolektorów słonecznych lub fotowoltaiki należy podać odpowiednio powierzchnię/moc instalacji."]
["5.","Sekcja III. Wskaźniki rocznego zapotrzebowania na ciepło do ogrzewania budynku "]
["5.1","Należy podać główne źródło ciepła / dominujące źródło ciepła wykorzystywane na potrzeby ogrzewania przed termomodernizacją i po termomodernizacji - źródło należy wybrać z listy rozwijanej. \nJeżeli w budynku znajduje się wiecej niż jedno źródeł ciepła, należy podać źródło, które jest wykorzystywane do ogrzewania największej powierzchni budynku. \nJeżeli przedsięwzięcie nie obejmuje wymiany źródła ciepła w polu \"przed termomodernizacją\" należy wybrać właściwe źródło ciepła a w polu \"po termomodernizacji\" należy wybrać: \"Nie obejmowało wymiany źródła ciepła\"."]
["5.2","Następnie należy podać wskaźnik rocznego zapotrzebowania na ciepło do ogrzewania budynku (z uwzględnienieniem sprawności systemu grzewczego i przerw w ogrzewaniu) [kWh/(m2*rok)] przed termomodernizacją i po termomodernizacji. "]
["5.3","Następnie należy odpowiedzić na pytania: Czy wartość redukcji emisji PM10/BaP/CO2 zostały wyliczone w audycie energetycznym. Jeżeli w ramach audytu energetycznego zostały obliczone te wartości - należy je wpisać odpowiednio w pola E34, E35 lub E36. W przeciwnym wypadku wartości zostaną wyliczone automatycznie."]
["6.","Sekcja IV. Wyliczenie efektów energetycznych i ekologicznych "]
["6.1","W tej sekcji wartości wyliczane są automatycznie."]
[]
["7.","W sekcji V. Oświadczenia Audytora należy wpisać datę przekazania audytu energetycznego Beneficjentowi."]
["8.","W sekcji VI. Uwagi, komentarze, podpis Audytor ma możliwość zamieszczenia dodatkowych informacji dla Beneficjenta, Gminy lub wojewódzkich funduszy ochrony środowiska i gospodarki wodnej."]
["9.","W sekcji VI. Uwagi, komentarze, podpis wymagany jest podpis Audytora. \nW sytuacji gdy Audytor podpisuje Dokument elektronicznie, w polu tym należy wpisać imię i nazwisko Audytora oraz dodać \"PODPISANY ELEKTRONICZNIE\". Następnie Dokument należy podpisać elektronicznie.\nW innym przypadku należy wydrukować Dokument i podpisać go ręcznie."]
[]
["10.","Do wniosku o płatność należy załączyć Dokument podsumowujący audyt energetyczny w wersji edytowalnej oraz w wersji podpisanej - np. jako skan podpisanego dokumentu, plik pdf podpisany elektronicznie, plik typu .zip z plikami podpisanymi i plikami podpisu."]
["Wersja 1.0"]

{"sheet":"DPAE","index":1,"n_rows":50,"n_cols":12,"rows_kept":50,"merged":[[0,0,0,8],[1,0,1,8],[2,7,2,8],[3,5,3,8],[4,7,4,8],[5,0,5,1],[5,4,5,6],[5,7,5,8],[6,0,6,8],[18,0,18,8],[19,1,19,6],[20,1,20,6],[21,0,21,8],[22,0,23,0],[22,1,23,1],[22,4,22,5],[22,6,22,7],[22,8,23,8],[24,4,24,5],[24,6,24,8],[25,1,25,3],[26,1,26,3],[30,0,30,8],[38,0,38,8],[39,1,39,6],[40,1,40,8],[42,0,42,3],[42,4,42,8],[43,0,43,3],[43,4,43,8],[44,0,44,3],[44,4,44,8],[45,0,45,3],[45,4,45,8],[46,0,46,8],[47,0,47,8],[48,0,48,8],[49,0,49,8]]}
["DOKUMENT PODSUMOWUJĄCY AUDYT ENERGETYCZNY\nPODSUMOWANIE OBLICZEŃ AUDYTOWYCH Z WYLICZENIEM EFEKTÓW ENERGETYCZNYCH I EKOLOGICZNYCH\nDOKUMENT POMOCNICZY DLA AUDYTORÓW ENERGETYCZNYCH W RAMACH PROGRAMU PRIORYTETOWEGO CIEPŁE MIESZKANIE \nNiniejszy dokument nie stanowi audytu energetycznego, a jest jedynie jego podsumowaniem. Oryginalny audyt energetyczny powinien być przechowywany przez Beneficjenta końcowego i udostępniany do kontroli \nprzez Gminę lub Wojewódzki Fundusz Ochrony Środowiska i Gospodarki Wodnej właściwy ze względu na lokalizację budynku/lokalu mieszkalnego, którego dotyczy, lub przez inny podmiot wskazany w umowie dotacji."]
["I. Dane o budynku mieszkalnym wielorodzinnym"]
[{"$nulls":4},"Kod pocztowy",null,"Miejscowość"]
["Adres budynku wielorodzinnego mieszkalnego",{"$nulls":3},"Ulica"]
[{"$nulls":4},"Nr budynku",null,"Liczba lokali w budynku"]
["Powierzchnia użytkowa budynku",{"$nulls":6},"m2"]
[" II. Zakres rzeczowy wchodzący w skład wariantu optymalnego z audytu energetycznego (wariantu wybranego do realizacji przez audytora) 1)  "]
[null,"Nazwa ",{"$nulls":5},"Współczynnik przenikania ciepła przegrody U przed termomodernizacją","Współczynnik przenikania ciepła przegrody U \npo termomodernizacji"]
["1.","Np. Modernizacja systemu grzewczego i systemu przygotowania ciepłej wody użytkowej",{"$nulls":5},"Nie dotyczy","Nie dotyczy"]
["2.","Np. Modernizacja przegrody ściana zewnętrzna piwnica i parter",{"$nulls":5},"Np. 0,999","Np. 0,111"]
["3.","Np. Wymiana okien",{"$nulls":5},"Np. 9,999","Np. 0,111"]
["4."]
["5."]
["6."]
["7."]
["8."]
["9."]
["10."]
["Odnawialne Źródła Energii (OZE) - jeśli dotyczy:"]
["1.","Kolektory słoneczne o powierzchni:",{"$nulls":6},"m2    "]
["2.","Instalacja fotowoltaiczna (PV) o mocy:",{"$nulls":6},"kWp"]
["III. Wskaźniki rocznego zapotrzebowania na ciepło do ogrzewania budynku i redukcji niektórych emisji - zgodnie z audytem energetycznym"]
[{"$nulls":4},"Przed termomodernizacją:",null,"Po termomodernizacji:",null,"Redukcja \nw [%]"]
[{"$nulls":4},"Wartość","Jednostka","Wartość","Jednostka"]
["1.","Główne źródło ciepła / Dominujące źródło ciepła2)",{"$nulls":7},{"$f":"AND(G25='Dane do przeliczeń'!$C$16,E25='Dane do przeliczeń'!$C$4)","v":false},{"$f":"AND(E25<>'Dane do przeliczeń'!$C$4,G25<>'Dane do przeliczeń'!$C$16)","v":true},{"$f":"OR(AND(E25<>0,G25=0),AND(E25=0,G25<>0))","v":false}]
["2.","Wskaźnik rocznego zapotrzebowania na ciepło do ogrzewania budynku \n(z uwzględnieniem sprawności systemu grzewczego i przerw w ogrzewaniu)3)",{"$nulls":3},"kWh/(m2*rok)",null,"kWh/(m2*rok)",{"$f":"IF(E26=\"\",\"\",IF(G26=\"\",\"\",ROUND((E26-G26)/E26,4)))","v":""}]
[null,"Wskaźnik rocznego zapotrzebowania na nieodnawialną energię pierwotną do ogrzewania budynku",null,null,{"$f":"IF(E25=\"\",\"Podaj główne źródło ciepła - powyżej\",IF(OR(AND(E25<>'Dane do przeliczeń'!$C$4,G25<>'Dane do przeliczeń'!$C$16),(AND(E25='Dane do przeliczeń'!$C$4,G25='Dane do przeliczeń'!$C$16))),\"Błąd - przedsięwzięcie niezgodne z PPCM\",IF(E26=\"\",\"Należy uzupełnić pole dla EK - powyżej\",E26*(VLOOKUP(E25,'Dane do przeliczeń'!$C$27:$L$34,4,FALSE)))))","v":"Podaj główne źródło ciepła - powyżej"},"kWh/(m2*rok)",{"$f":"IF(G25=\"\",\"Podaj główne źródło ciepła - powyżej\",IF(OR(AND(E25<>'Dane do przeliczeń'!$C$4,G25<>'Dane do przeliczeń'!$C$16),(AND(E25='Dane do przeliczeń'!$C$4,G25='Dane do przeliczeń'!$C$16))),\"Błąd - przedsięwzięcie niezgodne z PPCM\",IF(G26=\"\",\"Należy uzupełnić pole dla EK - powyżej\",IF(G25='Dane do przeliczeń'!$C$16,G26*(VLOOKUP(E25,'Dane do przeliczeń'!$C$27:$L$34,4,FALSE)),IF(OR($G$25='Dane do przeliczeń'!$C$6,$G$25='Dane do przeliczeń'!$C$7,$G$25='Dane do przeliczeń'!$C$8,$G$25='Dane do przeliczeń'!$C$9),MAX(0,G26*(VLOOKUP(G25,'Dane do przeliczeń'!$C$4:$L$16,4,FALSE))-($H$21*750/$E$6)),G26*(VLOOKUP(G25,'Dane do przeliczeń'!$C$4:$L$16,4,FALSE)))))))","v":"Podaj główne źródło ciepła - powyżej"},"kWh/(m2*rok)",{"$f":"IF(OR(E25=\"\",G25=\"\"),\"\",IF(OR(E25=\"\",G25=\"\"),\"\",IF(OR(AND(E25<>'Dane do przeliczeń'!$C$4,G25<>'Dane do przeliczeń'!$C$16),(AND(E25='Dane do przeliczeń'!$C$4,G25='Dane do przeliczeń'!$C$16))),\"Błąd - przedsięwzięcie niezgodne z PPCM\",IF(OR(E27=\"\",E27=\"Należy TUTAJ wpisać wartość z audytu\"),\"\",IF(G27=0,\"0%\",IFERROR(ROUND((E27-G27)/E27,4),\"\"))))))","v":""}]
["3.","Emisja pyłu PM10","Czy wartość została obliczona w audycie energetycznym?",null,{"$f":"IF(D28=\"\",\"\",IF(D28=\"TAK\",\"Należy TUTAJ wpisać wartość z audytu\",IF(E25=\"\",\"Podaj główne źródło ciepła - powyżej\",IF(OR(AND(E25<>'Dane do przeliczeń'!$C$4,G25<>'Dane do przeliczeń'!$C$16),(AND(E25='Dane do przeliczeń'!$C$4,G25='Dane do przeliczeń'!$C$16))),\"Błąd - przedsięwzięcie niezgodne z PPCM\",IF(OR(E27=\"\",E27=\"Należy TUTAJ wpisać wartość z audytu\"),\"Należy uzupełnić pola dla EP - powyżej\",IF(E27=\"Należy uzupełnić pole dla EK - powyżej\",\"Należy uzupełnić pole dla EK - powyżej\",IF(E27=\"Podaj główne źródło ciepła - powyżej\",\"Podaj główne źródło ciepła - powyżej\",(E27*$E$6/1000*(VLOOKUP(E25,'Dane do przeliczeń'!$C$27:$L$34,9,FALSE))))))))))","v":""},"g/rok",{"$f":"IF(D28=\"\",\"\",IF(D28=\"TAK\",\"Należy TUTAJ wpisać wartość z audytu\",IF(G25=\"\",\"Podaj główne źródło ciepła - powyżej\",IF(OR(AND(E25<>'Dane do przeliczeń'!$C$4,G25<>'Dane do przeliczeń'!$C$16),(AND(E25='Dane do przeliczeń'!$C$4,G25='Dane do przeliczeń'!$C$16))),\"Błąd - przedsięwzięcie niezgodne z PPCM\",IF(OR(G27=\"\",G27=\"Należy TUTAJ wpisać wartość z audytu\"),\"Należy uzupełnić pola dla EP - powyżej\",IF(G27=\"Należy uzupełnić pole dla EK - powyżej\",\"Należy uzupełnić pole dla EK - powyżej\",IF(G27=\"Podaj główne źródło ciepła - powyżej\",\"Podaj główne źródło ciepła - powyżej\",(G27*$E$6/1000*(IF(G25='Dane do przeliczeń'!$C$16,(VLOOKUP(E25,'Dane do przeliczeń'!$C$27:$L$34,9,FALSE)),(VLOOKUP(G25,'Dane do przeliczeń'!$C$4:$L$16,9,FALSE))))))))))))","v":""},"g/rok",{"$f":"IF(OR(E25=\"\",G25=\"\"),\"\",IF(OR(AND(E25<>'Dane do przeliczeń'!$C$4,G25<>'Dane do przeliczeń'!$C$16),(AND(E25='Dane do przeliczeń'!$C$4,G25='Dane do przeliczeń'!$C$16))),\"Błąd - przedsięwzięcie niezgodne z PPCM\",IF(OR(E28=\"\",E28=\"Należy TUTAJ wpisać wartość z audytu\",E28=\"Należy uzupełnić wartość EP powyżej\"),\"\",IF(AND(E28=0,G28=0),0,IFERROR(ROUND((E28-G28)/E28,4),\"\")))))","v":""}]
["4.","Emisja benzo(a)pirenu","Czy wartość została obliczona w audycie energetycznym?",null,{"$f":"IF(D29=\"\",\"\",IF(D29=\"TAK\",\"Należy TUTAJ wpisać wartość z audytu\",IF(E25=\"\",\"Podaj główne źródło ciepła - powyżej\",IF(OR(AND(E25<>'Dane do przeliczeń'!$C$4,G25<>'Dane do przeliczeń'!$C$16),(AND(E25='Dane do przeliczeń'!$C$4,G25='Dane do przeliczeń'!$C$16))),\"Błąd - przedsięwzięcie niezgodne z PPCM\",IF(OR(E27=\"\",E27=\"Należy TUTAJ wpisać wartość z audytu\"),\"Należy uzupełnić pola dla EP - powyżej\",IF(E27=\"Należy uzupełnić pole dla EK - powyżej\",\"Należy uzupełnić pole dla EK - powyżej\",IF(E27=\"Podaj główne źródło ciepła - powyżej\",\"Podaj główne źródło ciepła - powyżej\",(E27*$E$6/1000*(VLOOKUP(E25,'Dane do przeliczeń'!$C$27:$L$34,10,FALSE))))))))))","v":""},"g/rok",{"$f":"IF(D29=\"\",\"\",IF(D29=\"TAK\",\"Należy TUTAJ wpisać wartość z audytu\",IF(G25=\"\",\"Podaj główne źródło ciepła - powyżej\",IF(OR(AND(E25<>'Dane do przeliczeń'!$C$4,G25<>'Dane do przeliczeń'!$C$16),(AND(E25='Dane do przeliczeń'!$C$4,G25='Dane do przeliczeń'!$C$16))),\"Błąd - przedsięwzięcie niezgodne z PPCM\",IF(OR(G27=\"\",G27=\"Należy TUTAJ wpisać wartość z audytu\"),\"Należy uzupełnić pola dla EP - powyżej\",IF(G27=\"Należy uzupełnić pole dla EK - powyżej\",\"Należy uzupełnić pole dla EK - powyżej\",IF(G27=\"Podaj główne źródło ciepła - powyżej\",\"Podaj główne źródło ciepła - powyżej\",(G27*$E$6/1000*((IF(G25='Dane do przeliczeń'!$C$16,(VLOOKUP(E25,'Dane do przeliczeń'!$C$27:$L$34,10,FALSE)),(VLOOKUP(G25,'Dane do przeliczeń'!$C$4:$L$16,10,FALSE)))))))))))))","v":""},"g/rok",{"$f":"IF(OR(E25=\"\",G25=\"\"),\"\",IF(OR(AND(E25<>'Dane do przeliczeń'!$C$4,G25<>'Dane do przeliczeń'!$C$16),(AND(E25='Dane do przeliczeń'!$C$4,G25='Dane do przeliczeń'!$C$16))),\"Błąd - przedsięwzięcie niezgodne z PPCM\",IF(OR(E29=\"\",E29=\"Należy TUTAJ wpisać wartość z audytu\",E29=\"Należy uzupełnić wartość EP powyżej\"),\"\",IF(AND(E29=0,G29=0),0,IFERROR(ROUND((E29-G29)/E29,4),\"\")))))","v":""}]
["5.","Emisja CO2","Czy wartość została obliczona w audycie energetycznym?",null,{"$f":"IF(D30=\"\",\"\",IF(D30=\"TAK\",\"Należy TUTAJ wpisać wartość z audytu\",IF(E25=\"\",\"Podaj główne źródło ciepła - powyżej\",IF(OR(AND(E25<>'Dane do przeliczeń'!$C$4,G25<>'Dane do przeliczeń'!$C$16),(AND(E25='Dane do przeliczeń'!$C$4,G25='Dane do przeliczeń'!$C$16))),\"Błąd - przedsięwzięcie niezgodne z PPCM\",IF(E26=\"\",\"Należy uzupełnić pole dla EK - powyżej\",(E26*$E$6/1000*(VLOOKUP(E25,'Dane do przeliczeń'!$C$27:$L$34,8,FALSE))))))))","v":""},"kg/rok",{"$f":"IF(D30=\"\",\"\",IF(D30=\"TAK\",\"Należy TUTAJ wpisać wartość z audytu\",IF(G25=\"\",\"Podaj główne źródło ciepła - powyżej\",IF(OR(AND(E25<>'Dane do przeliczeń'!$C$4,G25<>'Dane do przeliczeń'!$C$16),(AND(E25='Dane do przeliczeń'!$C$4,G25='Dane do przeliczeń'!$C$16))),\"Błąd - przedsięwzięcie niezgodne z PPCM\",IF(G26=\"\",\"Należy uzupełnić pole dla EK - powyżej\",MAX(G26*$E$6/1000*(IF(G25='Dane do przeliczeń'!$C$16,(VLOOKUP(E25,'Dane do przeliczeń'!$C$27:$L$34,8,FALSE)),(VLOOKUP(G25,'Dane do przeliczeń'!$C$4:$L$16,8,FALSE))))-($H$21*750/10^3*'Dane do przeliczeń'!J15),0))))))","v":""},"kg/rok",{"$f":"IF(OR(E25=\"\",G25=\"\"),\"\",IF(OR(AND(E25<>'Dane do przeliczeń'!$C$4,G25<>'Dane do przeliczeń'!$C$16),(AND(E25='Dane do przeliczeń'!$C$4,G25='Dane do przeliczeń'!$C$16))),\"Błąd - przedsięwzięcie niezgodne z PPCM\",IF(OR(E30=\"\",E30=\"Należy TUTAJ wpisać wartość z audytu\",E30=\"Należy uzupełnić wartość EP powyżej\"),\"\",IF(AND(E29=0,G29=0),\"0%\",IFERROR(ROUND((E30-G30)/E30,4),\"\")))))","v":""}]
{"$rows_left_out":21}
{"sheet":"Dane do przeliczeń","index":2,"n_rows":47,"n_cols":12,"rows_kept":47,"merged":[[0,0,2,0],[0,1,2,1],[0,2,2,2],[0,3,2,3],[0,4,2,4],[0,5,2,5],[0,6,0,8],[0,9,0,11],[4,0,14,0],[17,1,17,11],[18,1,18,11],[19,1,19,11],[20,1,20,11],[23,2,25,2],[23,3,25,3],[23,4,25,4],[23,5,25,5],[23,6,23,8],[23,9,23,11]]}
["Przedsięwzięcie dot. źródła ciepła","Lp.","Źródło ciepła","paliwo:","uśredniona sezonowa sprawność źródła ciepła 1)","współczynnik nakładu nieodnawialnej energii pierwotnej 2)","Wskaźniki emisji zanieczyszczeń - przeliczone na GJ",null,null,"Wskaźniki emisji zanieczyszczeń - przeliczenie na MWh (do sporządzenia obliczeń metodą wskaźnikową)"]
[{"$nulls":6},"CO2 3)","PM10 4)","BaP 4)","CO2","PM10","BaP"]
[{"$nulls":6},"kg/GJ","g/GJ","g/GJ","kg/MWh","g/MWh","g/MWh"]
["Stary piec:",0,"Istniejące nieefektywne źródło ciepła na paliwo stałe - \"kopciuch\"","paliwo stałe",0.65,1.1,{"v":94.73,"d":"94.730"},{"v":427,"d":"427.000"},{"v":0.28,"d":"0.280"},{"$f":"G4*3.6","v":341.028},{"$f":"H4*3.6","v":{"v":1537.2,"d":"1,537.200"}},1.008]
["Wymiana żródła ciepła na żródło zgodne z Programem Czyste Powietrze:",1,"Podłączenie do sieci ciepłowniczej wraz z przyłączem","sieć ciepłownicza",0.95,1.1,{"v":93.54,"d":"93.540"},null,null,{"$f":"G5*3.6","v":336.744}]
[null,2,"Pompa ciepła powietrze/woda","energia elektryczna",3.5,2.5,{"$f":"J6/3.6","v":{"v":196.66666666666666,"d":"196.667"}},null,null,{"v":708,"d":"708.000"}]
[null,3,"Pompa ciepła powietrze/woda o podwyższonej klasie efektywności energetycznej","energia elektryczna",3.5,2.5,{"$f":"J7/3.6","v":{"v":196.66666666666666,"d":"196.667"}},null,null,{"v":708,"d":"708.000"}]
[null,4,"Pompa ciepła typu powietrze/powietrze","energia elektryczna",3.5,2.5,{"$f":"J8/3.6","v":{"v":196.66666666666666,"d":"196.667"}},null,null,{"v":708,"d":"708.000"}]
[null,5,"Gruntowa pompa ciepła o podwyższonej klasie efektywności energetycznej","energia elektryczna",3.5,2.5,{"$f":"J9/3.6","v":{"v":196.66666666666666,"d":"196.667"}},null,null,{"v":708,"d":"708.000"}]
[null,6,"Kocioł gazowy kondensacyjny","gaz ziemny",0.95,1.1,{"v":55.48,"d":"55.480"},{"v":0.3,"d":"0.300"},null,{"$f":"G10*3.6","v":{"v":199.72799999999998,"d":"199.728"}},{"v":1.08,"d":"1.080"}]
[null,7,"Kotłownia gazowa (w tym: przyłącze gazowe i instalacja)","gaz ziemny",0.95,1.1,{"v":55.48,"d":"55.480"},{"v":0.3,"d":"0.300"},null,{"v":199.72799999999998,"d":"199.728"},{"v":1.08,"d":"1.080"}]
[null,8,"Kocioł olejowy kondensacyjny","olej opałowy",0.95,1.1,{"v":77.75,"d":"77.750"},{"v":2,"d":"2.000"},{"$f":"0.12/1000","v":{"v":1.1999999999999999E-4,"d":"0.000120"}},{"v":279.90000000000003,"d":"279.900"},{"v":7.2,"d":"7.200"},{"$f":"I12*3.6","v":0.000432}]
[null,9,"Kocioł zgazowujący drewno o podwyższonym standardzie","biomasa",0.85,0.2,{"v":112,"d":"112.000"},{"v":16,"d":"16.000"},null,{"v":0,"d":"0.000"},{"$f":"H13*3.6","v":{"v":57.6,"d":"57.600"}}]
[null,10,"Kocioł na pellet drzewny o podwyższonym standardzie","biomasa",0.85,0.2,{"v":112,"d":"112.000"},{"v":16,"d":"16.000"},null,{"v":0,"d":"0.000"},{"v":57.6,"d":"57.600"}]
[null,11,"Ogrzewanie elektryczne","energia elektryczna",0.95,2.5,{"$f":"J15/3.6","v":{"v":196.66666666666666,"d":"196.667"}},null,null,{"v":708,"d":"708.000"}]
["Brak wymiany źródła",0,"Nie obejmowało wymiany źródła ciepła"]
[null,9,"Kocioł na węgiel z automatycznym podajnikiem","paliwo stałe",0.85,1.1,{"v":94.73,"d":"94.730"},{"v":18,"d":"18.000"},null,{"$f":"G17*3.6","v":341.028},{"$f":"H17*3.6","v":{"v":64.8,"d":"64.800"}}]
["1)","Na podstawie dostępnej literatury"]
["2)","Zgodnie z Rozporządzeniem Ministra Infrastruktury i Rozwoju z dnia 27 lutego 2015 r. w sprawie metodologii wyznaczania charakterystyki energetycznej budynku lub części budynku oraz świadectw charakterystyki energetycznej."]
["3)","Zgodnie z opracowaniem KOBIZE: \"Wartości opałowe (WO) i wskaźniki emisji CO2 (WE) w roku 2020 do raportowania w ramach Systemu Handlu Uprawnieniami do Emisji za rok 2023\" z grudnia 2022 r. lub WSKAŹNIKI EMISYJNOŚCI CO2, SO2, NOx, CO i pyłu całkowitego DLA ENERGII ELEKTRYCZNEJ na podstawie informacji zawartych w Krajowej bazie o emisjach gazów cieplarnianych i innych substancji za 2020 rok"]
["4)","Zgodnie z zestawienie tabelarycznym Wskaźniki emisji zanieczyszczeń powietrza emitowanych z indywidualnych źródeł ciepła opracowane przez Instytut Chemicznej Przeróbki Węgla (wartości wskaźników zostały zaktualizowane w związku z pracą zrealizowaną przez Instytut Chemicznej Przeróbki Węgla na zlecenie IOŚ-PIB KOBiZE. Aktualizacja dokonywana w zależności od zmian prawnych i gospodarczych). (dane dla pozycji: 8, 21, 22, 33,34) Dane na dzień: 23 czerwca 2021. Dostęp: https://dane.gov.pl/pl/dataset/2182/resource/31256/table"]
[]
["TAK"]
["NIE",null,"Źródło przed termo","paliwo:","uśredniona sezonowa sprawność źródła ciepła 1)","współczynnik nakładu nieodnawialnej energii pierwotnej 2)","Wskaźniki emisji zanieczyszczeń - przeliczone na GJ",null,null,"Wskaźniki emisji zanieczyszczeń - przeliczenie na MWh (do sporządzenia obliczeń metodą wskaźnikową)"]
[{"$nulls":6},"CO2 3)","PM10 4)","BaP 4)","CO2","PM10","BaP"]
[{"$nulls":6},"kg/GJ","g/GJ","g/GJ","kg/MWh","g/MWh","g/MWh"]
[null,null,{"$f":"C4","v":"Istniejące nieefektywne źródło ciepła na paliwo stałe - \"kopciuch\""},{"$f":"VLOOKUP($C27,$C$4:$L$17,2,FALSE)","v":"paliwo stałe"},{"$f":"VLOOKUP($C27,$C$4:$L$17,3,FALSE)","v":0.65},{"$f":"VLOOKUP($C27,$C$4:$L$17,4,FALSE)","v":1.1},{"$f":"VLOOKUP($C27,$C$4:$L$17,5,FALSE)","v":{"v":94.73,"d":"94.730"}},{"$f":"VLOOKUP($C27,$C$4:$L$17,6,FALSE)","v":{"v":427,"d":"427.000"}},{"$f":"VLOOKUP($C27,$C$4:$L$17,7,FALSE)","v":{"v":0.28,"d":"0.280"}},{"$f":"VLOOKUP($C27,$C$4:$L$17,8,FALSE)","v":341.028},{"v":1537,"d":"1,537.000"},{"$f":"VLOOKUP($C27,$C$4:$L$17,10,FALSE)","v":1.008}]
[null,null,"Podłączenie do sieci ciepłowniczej",{"$f":"VLOOKUP(C5,$C$4:$L$17,2,FALSE)","v":"sieć ciepłownicza"},{"$f":"VLOOKUP(C5,$C$4:$L$17,3,FALSE)","v":0.95},{"$f":"VLOOKUP(C5,$C$4:$L$17,4,FALSE)","v":1.1},{"$f":"VLOOKUP(C5,$C$4:$L$17,5,FALSE)","v":{"v":93.54,"d":"93.540"}},{"$f":"VLOOKUP(C5,$C$4:$L$17,6,FALSE)","v":{"v":0,"d":"0.000"}},{"$f":"VLOOKUP(C5,$C$4:$L$17,7,FALSE)","v":{"v":0,"d":"0.000"}},{"$f":"VLOOKUP(C5,$C$4:$L$17,8,FALSE)","v":336.744},{"$f":"VLOOKUP(C5,$C$4:$L$17,9,FALSE)","v":{"v":0,"d":"0.000"}},{"$f":"VLOOKUP(C5,$C$4:$L$17,10,FALSE)","v":{"v":0,"d":"0.000"}}]
[null,null,"Pompa ciepła",{"$f":"VLOOKUP(C6,$C$4:$L$17,2,FALSE)","v":"energia elektryczna"},3.5,{"$f":"VLOOKUP(C6,$C$4:$L$17,4,FALSE)","v":2.5},{"$f":"VLOOKUP(C6,$C$4:$L$17,5,FALSE)","v":{"v":196.66666666666666,"d":"196.667"}},{"$f":"VLOOKUP(C6,$C$4:$L$17,6,FALSE)","v":{"v":0,"d":"0.000"}},{"$f":"VLOOKUP(C6,$C$4:$L$17,7,FALSE)","v":{"v":0,"d":"0.000"}},{"$f":"VLOOKUP(C6,$C$4:$L$17,8,FALSE)","v":{"v":708,"d":"708.000"}},{"$f":"VLOOKUP(C6,$C$4:$L$17,9,FALSE)","v":{"v":0,"d":"0.000"}},{"$f":"VLOOKUP(C6,$C$4:$L$17,10,FALSE)","v":{"v":0,"d":"0.000"}}]
[null,null,"Kocioł gazowy",{"$f":"VLOOKUP(C10,$C$4:$L$17,2,FALSE)","v":"gaz ziemny"},{"$f":"VLOOKUP(C10,$C$4:$L$17,3,FALSE)","v":0.95},{"$f":"VLOOKUP(C10,$C$4:$L$17,4,FALSE)","v":1.1},{"$f":"VLOOKUP(C10,$C$4:$L$17,5,FALSE)","v":{"v":55.48,"d":"55.480"}},{"$f":"VLOOKUP(C10,$C$4:$L$17,6,FALSE)","v":{"v":0.3,"d":"0.300"}},{"$f":"VLOOKUP(C10,$C$4:$L$17,7,FALSE)","v":{"v":0,"d":"0.000"}},{"$f":"VLOOKUP(C10,$C$4:$L$17,8,FALSE)","v":{"v":199.72799999999998,"d":"199.728"}},{"$f":"VLOOKUP(C10,$C$4:$L$17,9,FALSE)","v":{"v":1.08,"d":"1.080"}},{"$f":"VLOOKUP(C10,$C$4:$L$17,10,FALSE)","v":{"v":0,"d":"0.000"}}]
{"$rows_left_out":17}